{"text_format":"1","workbook":"xlsx","n_sheets":11,"sheets":["5 I","5 II","5 III","6 I","6 II","6 III","Общо І","Общо ІІ","Общо ІІІ","obl","zav"],"not_rendered":{"charts":0,"images":0,"macros":1,"external_links":0,"defined_names":0,"comments":0,"pivot_tables":0},"unopened":[],"bounds":{"document_bytes":16777216,"sheet_cells":100000,"rows_first":2000,"rows_last":500,"rows_between":2000,"halvings":0,"cell_chars":16384,"cell_head_chars":4096},"cells_cut":0,"cells_raw":0,"read":"whole","date_system":"1900"}

{"sheet":"5 I","index":0,"n_rows":350,"n_cols":12,"rows_kept":350,"cut":false,"hidden":false,"merged":[[2,11,3,13],[0,11,0,13],[1,11,1,13],[10,1,11,1],[10,2,11,2],[5,1,5,5],[0,2,0,3],[1,2,1,5],[2,4,2,5],[0,5,0,8],[10,3,10,5]]}
[{"$f":"IF(ISNA(VLOOKUP(C1,obl!A1:B28,2,FALSE))=TRUE,\"\",(VLOOKUP(C1,obl!A1:B28,2,FALSE)))","v":"05"},"Област:","05 Видин                ",null,null,{"$f":"IF(MID(C1,1,2)=MID(C2,1,2),\" \",\"избери заведение от същата област\")","v":"избери заведение от същата област"},null,null,null,null,null,"ПРИЛОЖЕНИ №5 и №6"]
[{"$f":"IF(ISNA(VLOOKUP(C2,zav!B1:C196,2,FALSE))=TRUE,\"\",(VLOOKUP(C2,zav!B1:C196,2,FALSE)))","v":""},"Лечебно заведение:",null,null,null,null,null,null,null,null,null,"към формуляр №365-О"]
[null,"Година:",2023,null,null,null,null,null,null,null,null,"Представя се от всички заведения за извънболнична помощ"]
[]
[]
[1,"Регистрирани заболявания в амбулаториите на лечебните заведения по вид на заболяването на деца от 0 до 17 годишна възраст"]
[]
[null,"Раздел I"]
[]
[null,null,null,null,null,null,null,"ХОРИЗОНТАЛЕН КОНТРОЛ:"]
[null,"НАИМЕНОВАНИЕ НА БОЛЕСТИТЕ ПО МКБ–10","Ши-фър","Регистрирани заболявания",null,null,null,"к.1і   к.2","к.1і   к.3"]
[null,null,null,"всичко","в т. ч. деца до 1 год.","Новооткрити заболявания - всичко"]
[null,"а","б",1,2,3]
[null,"ОБЩО I-XIX и ХХІІ клас","001",null,null,null,null,{"$f":"IF(D14<E14,\"грешка\",\"\")","v":""},{"$f":"IF(D14<F14,\"грешка\",\"\")","v":""}]
[null,"I. Някои инфекциозни и паразитни болести A00-B99","002",null,null,null,null,{"$f":"IF(D15<E15,\"грешка\",\"\")","v":""},{"$f":"IF(D15<F15,\"грешка\",\"\")","v":""}]
[null,"Чревни инфекции А00-А09","003",null,null,null,null,"",""]
[null,"Други салмонелозни инфекции А02","004",null,null,null,null,"",""]
[null,"Шигелоза А03","005",null,null,null,null,"",""]
[null,"Туберкулоза А15-А19","006",null,null,null,null,{"$f":"IF(D19<E19,\"грешка\",\"\")","v":""},{"$f":"IF(D19<F19,\"грешка\",\"\")","v":""}]
[null,"Сифилис А50-А53","007",null,null,null,null,"",""]
[null,"Вирусен хепатит В15-В19","008",null,null,null,null,"",""]
[null,"Аскаридоза В77","009",null,null,null,null,"",""]
[null,"Ентеробиоза В80","010",null,null,null,null,"",""]
[null,"II. Новообразувания C00-D48","011",null,null,null,null,"",""]
[null,"Злокачествени новообразувания C00-C97","012",null,null,null,null,"",""]
[null,"Доброкачествени новообразувания D10-D36","013",null,null,null,null,"",""]
[null,"III. Болести на кръвта, кръвотворните органи и отделни нарушения, включващи имунния механизъм D50–D89 ","014",null,null,null,null,"",""]
[null,"Анемии, свързани с храненето D50-D53","015",null,null,null,null,"",""]
[null,"Желязонедоимъчна анемия D50","016",null,null,null,null,"",""]
[null,"Хемолитични анемии D55-D59","017",null,null,null,null,"",""]
{"$rows_left_out":321}
{"sheet":"5 II","index":1,"n_rows":34,"n_cols":9,"rows_kept":34,"cut":false,"hidden":false,"merged":[[5,1,5,5],[2,4,2,5],[10,1,11,1],[10,2,11,2],[10,3,10,5]]}
[{"$f":"'5 I'!A1","v":"05"},"Област:",{"$f":"'5 I'!C1","v":"05 Видин                "}]
[{"$f":"'5 I'!A2","v":""},"Лечебно заведение:",{"$f":"'5 I'!C2","v":0}]
[null,"Година:",{"$f":"'5 I'!C3","v":2023}]
[]
[]
[2,"Фактори, влияещи върху здравното състояние на населението и контакта със здравните служби на деца от 0 до 17 годишна възраст"]
[]
[null,"Раздел IІ"]
[]
[null,null,null,null,null,null,null,"ХОРИЗОНТАЛЕН КОНТРОЛ:"]
[null,"НАИМЕНОВАНИЕ НА БОЛЕСТИТЕ ПО МКБ–10","Ши-фър","Регистрирани случаи",null,null,null,"к.1і   к.2","к.1і   к.3"]
[null,null,null,"всичко","в т. ч. деца до 1 год.","Новооткрити заболявания - всичко"]
[null,"а","б",1,2,3]
[null,"ХXI. Фактори, влияещи върху здравното състояние на населението и контакта със здравните служби Z00-Z99","01",null,null,null,null,{"$f":"IF(D14<E14,\"грешка\",\"\")","v":""},{"$f":"IF(D14<F14,\"грешка\",\"\")","v":""}]
[null,"Лица, обърнали се към здравните служби за медицински преглед и изследване Z00-Z13","02",null,null,null,null,{"$f":"IF(D15<E15,\"грешка\",\"\")","v":""},{"$f":"IF(D15<F15,\"грешка\",\"\")","v":""}]
[null,"Общ преглед и изследване на лица, които нямат оплаквания или установена диагноза Z00","03",null,null,null,null,"",""]
[null,"Други специални прегледи и изследвания на лица, които нямат оплаквания или установена диагноза Z01","04",null,null,null,null,"",""]
[null,"Изследване и обръщане с административни цели Z02","05",null,null,null,null,"",""]
[null,"Лица, обърнали се към здравни служби във връзка с обстоятелства, отнасящи се до репродуктивната функция Z30-Z39","06",null,null,null,null,"",""]
[null,"Наблюдение върху прилагането на противозачатъчни средства Z30","07",null,null,null,null,"",""]
[null,"Наблюдение върху протичането на нормална бременност Z34","08",null,null,null,null,"",""]
[null,"Грижа за изкуствени отвори Z43","09",null,null,null,null,"",""]
[null,"Помощ, включваща използване на рехабилитационни процедури Z50","10",null,null,null,null,"",""]
[null,"Рехабилитация при болест на сърцето Z50.0","11",null,null,null,null,"",""]
[null,"Друг вид физиотерапия Z50.1","12",null,null,null,null,"",""]
[null,"Рехабилитация на лица, страдащи от алкохолизъм Z50.2","13",null,null,null,null,"",""]
[null,"Рехабилитация на лица, страдащи от наркомания Z50.3","14",null,null,null,null,"",""]
[null,"Жертва на престъпление и тероризъм Z65.4","15",null,null,null,null,"",""]
[]
["ВЕРТИКАЛЕН КОНТРОЛ:"]
{"$rows_left_out":5}
{"sheet":"5 III","index":2,"n_rows":37,"n_cols":12,"rows_kept":37,"cut":false,"hidden":false,"merged":[[10,3,10,4],[10,1,11,1],[5,1,5,4],[2,4,2,5],[10,2,11,2]]}
[{"$f":"'5 I'!A1","v":"05"},"Област:",{"$f":"'5 I'!C1","v":"05 Видин                "}]
[{"$f":"'5 I'!A2","v":""},"Лечебно заведение:",{"$f":"'5 I'!C2","v":0}]
[null,"Година:",{"$f":"'5 I'!C3","v":2023}]
[]
[]
[3,"Външни причини за заболеваемост и смъртност на деца от 0 до 17 годишна възраст"]
[]
[null,"Раздел IІІ"]
[]
[null,null,null,null,null,null,"ХОРИЗОНТАЛЕН КОНТРОЛ:"]
[null,"НАИМЕНОВАНИЕ  ПО МКБ–10","Ши-фър","Регистрирани случаи",null,null,"к.1і   к.2"]
[null,null,null,"всичко","в т. ч. деца до 1 год."]
[null,"а","б",1,2]
[null,"ХХ. Външни причини за заболеваемост и смъртност V01–Y98","01",null,null,null,{"$f":"IF(D14<E14,\"грешка\",\"\")","v":""}]
[null,"Злополуки V01–X59","02",null,null,null,{"$f":"IF(D15<E15,\"грешка\",\"\")","v":""}]
[null,"Транспортни злополуки V01–V99","03",null,null,null,""]
[null,"Пешеходец или велосипедист, пострадал при транспортна злополука V01–V19 ","04",null,null,null,""]
[null,"Мотоциклетист; лице, намиращо се в: моторно превозно средство на три колела; лек автомобил; тежкотоварен автомобил; автобус и пострадало при транспортна злополука; злополуки, свързани с други наземни транспортни средства; при воден транспорт; при въздушен транспорт и космически полети, и други V20–V99","05",null,null,null,""]
[null,"Други външни причини за травми при злополуки W00–X59","06",null,null,null,""]
[null,"Падания W00–W19","07",null,null,null,""]
[null,"Въздействие на неживи или живи механични сили W20–W64","08",null,null,null,""]
[null,"Случайно удавяне и потъване във вода и други злополуки със заплаха за дишането W65–W84","09",null,null,null,""]
[null,"Злополуки, предизвикани от въздействие на електрически ток, облъчване и екстремни стойности на температурата на околната среда или атмосферното налягане W85–W99","10",null,null,null,""]
[null,"Въздействие на дим, огън и пламък и съприкосновение с горещи и нажежени вещества (предмети) X00–X19","11",null,null,null,""]
[null,"Контакт с отровни животни и растения X20–X29","12",null,null,null,""]
[null,"Случайно отравяне и въздействие на отровни вещества X40–X49","13",null,null,null,""]
[null,"Умишлено самонараняване X60–X84","14",null,null,null,""]
[null,"Нападение X85–Y09","15",null,null,null,""]
[null,"Законни действия и военни операции Y35–Y36","16",null,null,null,""]
[]
{"$rows_left_out":8}
{"sheet":"6 I","index":3,"n_rows":350,"n_cols":7,"rows_kept":350,"cut":false,"hidden":false,"merged":[[10,1,11,1],[10,2,11,2],[10,3,10,4],[5,1,5,4],[0,8,0,10],[1,8,1,10]]}
[{"$f":"'5 I'!A1","v":"05"},"Област:",{"$f":"'5 I'!C1","v":"05 Видин                "}]
[{"$f":"'5 I'!A2","v":""},"Лечебно заведение:",{"$f":"'5 I'!C2","v":0}]
[null,"Година:",{"$f":"'5 I'!C3","v":2023}]
[]
[]
[4,"Регистрирани заболявания в амбулаториите на лечебните заведения по вид на заболяването на лица на възраст над 18 години"]
[]
[null,"Раздел I"]
[]
[null,null,null,null,null,null,"ХОРИЗОНТАЛЕН КОНТРОЛ:"]
[null,"НАИМЕНОВАНИЕ НА БОЛЕСТИТЕ ПО МКБ–10","Ши-фър","Регистрирани заболявания",null,null,"к.1і   к.2"]
[null,null,null,"всичко","в т.ч. новооткрити "]
[null,"а","б",1,2]
[null,"ОБЩО I-XIX и ХХІІ клас","001",null,null,null,{"$f":"IF(D14<E14,\"грешка\",\"\")","v":""}]
[null,"I. Някои инфекциозни и паразитни болести A00-B99","002",null,null,null,{"$f":"IF(D15<E15,\"грешка\",\"\")","v":""}]
[null,"Чревни инфекции А00-А09","003",null,null,null,""]
[null,"Други салмонелозни инфекции А02","004",null,null,null,""]
[null,"Шигелоза А03","005",null,null,null,""]
[null,"Туберкулоза А15-А19","006",null,null,null,""]
[null,"Сифилис А50-А53","007",null,null,null,""]
[null,"Вирусен хепатит В15-В19","008",null,null,null,""]
[null,"Аскаридоза В77","009",null,null,null,""]
[null,"Ентеробиоза В80","010",null,null,null,""]
[null,"II. Новообразувания C00-D48","011",null,null,null,""]
[null,"Злокачествени новообразувания C00-C97","012",null,null,null,""]
[null,"Доброкачествени новообразувания D10-D36","013",null,null,null,""]
[null,"III. Болести на кръвта, кръвотворните органи и отделни нарушения, включващи имунния механизъм D50–D89 ","014",null,null,null,""]
[null,"Анемии, свързани с храненето D50-D53","015",null,null,null,""]
[null,"Желязонедоимъчна анемия D50","016",null,null,null,""]
[null,"Хемолитични анемии D55-D59","017",null,null,null,""]
{"$rows_left_out":321}
{"sheet":"6 II","index":4,"n_rows":34,"n_cols":7,"rows_kept":34,"cut":false,"hidden":false,"merged":[[5,1,5,4],[10,1,11,1],[10,2,11,2],[10,3,10,4]]}
[{"$f":"'5 I'!A1","v":"05"},"Област:",{"$f":"'5 I'!C1","v":"05 Видин                "}]
[{"$f":"'5 I'!A2","v":""},"Лечебно заведение:",{"$f":"'5 I'!C2","v":0}]
[null,"Година:",{"$f":"'5 I'!C3","v":2023}]
[]
[]
[5,"Фактори, влияещи върху здравното състояние на населението и контакта със здравните служби на лица на възраст над 18 години"]
[]
[null,"Раздел IІ"]
[]
[null,null,null,null,null,null,"ХОРИЗОНТАЛЕН КОНТРОЛ:"]
[null,"НАИМЕНОВАНИЕ НА БОЛЕСТИТЕ ПО МКБ–10","Ши-фър","Регистрирани случаи",null,null,"к.1і   к.2"]
[null,null,null,"всичко","в т.ч. новооткрити заболявания"]
[null,"а","б",1,2]
[null,"ХXI. Фактори, влияещи върху здравното състояние на населението и контакта със здравните служби Z00-Z99","01",null,null,null,{"$f":"IF(D14<E14,\"грешка\",\"\")","v":""}]
[null,"Лица, обърнали се към здравните служби за медицински преглед и изследване Z00-Z13","02",null,null,null,{"$f":"IF(D15<E15,\"грешка\",\"\")","v":""}]
[null,"Общ преглед и изследване на лица, които нямат оплаквания или установена диагноза Z00","03",null,null,null,""]
[null,"Други специални прегледи и изследвания на лица, които нямат оплаквания или установена диагноза Z01","04",null,null,null,""]
[null,"Изследване и обръщане с административни цели Z02","05",null,null,null,""]
[null,"Лица, обърнали се към здравни служби във връзка с обстоятелства, отнасящи се до репродуктивната функция Z30-Z39","06",null,null,null,""]
[null,"Наблюдение върху прилагането на противозачатъчни средства Z30","07",null,null,null,""]
[null,"Наблюдение върху протичането на нормална бременност Z34","08",null,null,null,""]
[null,"Грижа за изкуствени отвори Z43","09",null,null,null,""]
[null,"Помощ, включваща използване на рехабилитационни процедури Z50","10",null,null,null,""]
[null,"Рехабилитация при болест на сърцето Z50.0","11",null,null,null,""]
[null,"Друг вид физиотерапия Z50.1","12",null,null,null,""]
[null,"Рехабилитация на лица, страдащи от алкохолизъм Z50.2","13",null,null,null,""]
[null,"Рехабилитация на лица, страдащи от наркомания Z50.3","14",null,null,null,""]
[null,"Жертва на престъпление и тероризъм Z65.4","15",null,null,null,""]
[]
["ВЕРТИКАЛЕН КОНТРОЛ:"]
{"$rows_left_out":5}
{"sheet":"6 III","index":5,"n_rows":37,"n_cols":4,"rows_kept":37,"cut":false,"hidden":false,"merged":[[5,1,5,3],[10,1,11,1],[10,2,11,2],[10,3,11,3]]}
[{"$f":"'5 I'!A1","v":"05"},"Област:",{"$f":"'5 I'!C1","v":"05 Видин                "}]
[{"$f":"'5 I'!A2","v":""},"Лечебно заведение:",{"$f":"'5 I'!C2","v":0}]
[null,"Година:",{"$f":"'5 I'!C3","v":2023}]
[]
[]
[6,"Външни причини за заболеваемост и смъртност на лица на възраст над 18 години"]
[]
[null,"Раздел IІІ"]
[]
[]
[null,"НАИМЕНОВАНИЕ  ПО МКБ–10","Ши-фър","Регистрирани случаи"]
[]
[null,"а","б",1]
[null,"ХХ. Външни причини за заболеваемост и смъртност V01–Y98","01"]
[null,"Злополуки V01–X59","02"]
[null,"Транспортни злополуки V01–V99","03"]
[null,"Пешеходец или велосипедист, пострадал при транспортна злополука V01–V19 ","04"]
[null,"Мотоциклетист; лице, намиращо се в: моторно превозно средство на три колела; лек автомобил; тежкотоварен автомобил; автобус и пострадало при транспортна злополука; злополуки, свързани с други наземни транспортни средства; при воден транспорт; при въздушен транспорт и космически полети, и други V20–V99","05"]
[null,"Други външни причини за травми при злополуки W00–X59","06"]
[null,"Падания W00–W19","07"]
[null,"Въздействие на неживи или живи механични сили W20–W64","08"]
[null,"Случайно удавяне и потъване във вода и други злополуки със заплаха за дишането W65–W84","09"]
[null,"Злополуки, предизвикани от въздействие на електрически ток, облъчване и екстремни стойности на температурата на околната среда или атмосферното налягане W85–W99","10"]
[null,"Въздействие на дим, огън и пламък и съприкосновение с горещи и нажежени вещества (предмети) X00–X19","11"]
[null,"Контакт с отровни животни и растения X20–X29","12"]
[null,"Случайно отравяне и въздействие на отровни вещества X40–X49","13"]
[null,"Умишлено самонараняване X60–X84","14"]
[null,"Нападение X85–Y09","15"]
[null,"Законни действия и военни операции Y35–Y36","16"]
[]
{"$rows_left_out":8}
{"sheet":"Общо І","index":6,"n_rows":350,"n_cols":7,"rows_kept":350,"cut":false,"hidden":false,"merged":[[10,1,11,1],[10,2,11,2],[10,3,10,4],[5,1,5,4]]}
[{"$f":"'5 I'!A1","v":"05"},"Област:",{"$f":"'5 I'!C1","v":"05 Видин                "}]
[{"$f":"'5 I'!A2","v":""},"Лечебно заведение:",{"$f":"'5 I'!C2","v":0}]
[null,"Година:",{"$f":"'5 I'!C3","v":2023}]
[]
[]
[4,"Регистрирани заболявания в амбулаториите на лечебните заведения по вид на заболяването - ОБЩО"]
[]
[null,"Раздел I"]
[]
[null,null,null,null,null,null,"ХОРИЗОНТАЛЕН КОНТРОЛ:"]
[null,"НАИМЕНОВАНИЕ НА БОЛЕСТИТЕ ПО МКБ–10","Ши-фър","Регистрирани заболявания",null,null,"к.1і   к.2"]
[null,null,null,"всичко","в т.ч. новооткрити "]
[null,"а","б",1,2]
[null,"ОБЩО I-XIX и ХХІІ клас","001",{"$f":"'5 I'!D14+'6 I'!D14","v":0},{"$f":"'5 I'!F14+'6 I'!E14","v":0},null,{"$f":"IF(D14<E14,\"грешка\",\"\")","v":""}]
[null,"I. Някои инфекциозни и паразитни болести A00-B99","002",{"$f":"'5 I'!D15+'6 I'!D15","v":0},{"$f":"'5 I'!F15+'6 I'!E15","v":0},null,{"$f":"IF(D15<E15,\"грешка\",\"\")","v":""}]
[null,"Чревни инфекции А00-А09","003",{"$f":"'5 I'!D16+'6 I'!D16","v":0},{"$f":"'5 I'!F16+'6 I'!E16","v":0},null,""]
[null,"Други салмонелозни инфекции А02","004",{"$f":"'5 I'!D17+'6 I'!D17","v":0},{"$f":"'5 I'!F17+'6 I'!E17","v":0},null,""]
[null,"Шигелоза А03","005",{"$f":"'5 I'!D18+'6 I'!D18","v":0},{"$f":"'5 I'!F18+'6 I'!E18","v":0},null,""]
[null,"Туберкулоза А15-А19","006",{"$f":"'5 I'!D19+'6 I'!D19","v":0},{"$f":"'5 I'!F19+'6 I'!E19","v":0},null,""]
[null,"Сифилис А50-А53","007",{"$f":"'5 I'!D20+'6 I'!D20","v":0},{"$f":"'5 I'!F20+'6 I'!E20","v":0},null,""]
[null,"Вирусен хепатит В15-В19","008",{"$f":"'5 I'!D21+'6 I'!D21","v":0},{"$f":"'5 I'!F21+'6 I'!E21","v":0},null,""]
[null,"Аскаридоза В77","009",{"$f":"'5 I'!D22+'6 I'!D22","v":0},{"$f":"'5 I'!F22+'6 I'!E22","v":0},null,""]
[null,"Ентеробиоза В80","010",{"$f":"'5 I'!D23+'6 I'!D23","v":0},{"$f":"'5 I'!F23+'6 I'!E23","v":0},null,""]
[null,"II. Новообразувания C00-D48","011",{"$f":"'5 I'!D24+'6 I'!D24","v":0},{"$f":"'5 I'!F24+'6 I'!E24","v":0},null,""]
[null,"Злокачествени новообразувания C00-C97","012",{"$f":"'5 I'!D25+'6 I'!D25","v":0},{"$f":"'5 I'!F25+'6 I'!E25","v":0},null,""]
[null,"Доброкачествени новообразувания D10-D36","013",{"$f":"'5 I'!D26+'6 I'!D26","v":0},{"$f":"'5 I'!F26+'6 I'!E26","v":0},null,""]
[null,"III. Болести на кръвта, кръвотворните органи и отделни нарушения, включващи имунния механизъм D50–D89 ","014",{"$f":"'5 I'!D27+'6 I'!D27","v":0},{"$f":"'5 I'!F27+'6 I'!E27","v":0},null,""]
[null,"Анемии, свързани с храненето D50-D53","015",{"$f":"'5 I'!D28+'6 I'!D28","v":0},{"$f":"'5 I'!F28+'6 I'!E28","v":0},null,""]
[null,"Желязонедоимъчна анемия D50","016",{"$f":"'5 I'!D29+'6 I'!D29","v":0},{"$f":"'5 I'!F29+'6 I'!E29","v":0},null,""]
[null,"Хемолитични анемии D55-D59","017",{"$f":"'5 I'!D30+'6 I'!D30","v":0},{"$f":"'5 I'!F30+'6 I'!E30","v":0},null,""]
{"$rows_left_out":321}
{"sheet":"Общо ІІ","index":7,"n_rows":34,"n_cols":7,"rows_kept":34,"cut":false,"hidden":false,"merged":[[5,1,5,4],[10,1,11,1],[10,2,11,2],[10,3,10,4]]}
[{"$f":"'5 I'!A1","v":"05"},"Област:",{"$f":"'5 I'!C1","v":"05 Видин                "}]
[{"$f":"'5 I'!A2","v":""},"Лечебно заведение:",{"$f":"'5 I'!C2","v":0}]
[null,"Година:",{"$f":"'5 I'!C3","v":2023}]
[]
[]
[5,"Фактори, влияещи върху здравното състояние на населението и контакта със здравните служби - ОБЩО"]
[]
[null,"Раздел IІ"]
[]
[null,null,null,null,null,null,"ХОРИЗОНТАЛЕН КОНТРОЛ:"]
[null,"НАИМЕНОВАНИЕ НА БОЛЕСТИТЕ ПО МКБ–10","Ши-фър","Регистрирани случаи",null,null,"к.1і   к.2"]
[null,null,null,"всичко","в т.ч. новооткрити заболявания"]
[null,"а","б",1,2]
[null,"ХXI. Фактори, влияещи върху здравното състояние на населението и контакта със здравните служби Z00-Z99","01",{"$f":"'5 II'!D14+'6 II'!D14","v":0},{"$f":"'5 II'!F14+'6 II'!E14","v":0},null,{"$f":"IF(D14<E14,\"грешка\",\"\")","v":""}]
[null,"Лица, обърнали се към здравните служби за медицински преглед и изследване Z00-Z13","02",{"$f":"'5 II'!D15+'6 II'!D15","v":0},{"$f":"'5 II'!F15+'6 II'!E15","v":0},null,{"$f":"IF(D15<E15,\"грешка\",\"\")","v":""}]
[null,"Общ преглед и изследване на лица, които нямат оплаквания или установена диагноза Z00","03",{"$f":"'5 II'!D16+'6 II'!D16","v":0},{"$f":"'5 II'!F16+'6 II'!E16","v":0},null,""]
[null,"Други специални прегледи и изследвания на лица, които нямат оплаквания или установена диагноза Z01","04",{"$f":"'5 II'!D17+'6 II'!D17","v":0},{"$f":"'5 II'!F17+'6 II'!E17","v":0},null,""]
[null,"Изследване и обръщане с административни цели Z02","05",{"$f":"'5 II'!D18+'6 II'!D18","v":0},{"$f":"'5 II'!F18+'6 II'!E18","v":0},null,""]
[null,"Лица, обърнали се към здравни служби във връзка с обстоятелства, отнасящи се до репродуктивната функция Z30-Z39","06",{"$f":"'5 II'!D19+'6 II'!D19","v":0},{"$f":"'5 II'!F19+'6 II'!E19","v":0},null,""]
[null,"Наблюдение върху прилагането на противозачатъчни средства Z30","07",{"$f":"'5 II'!D20+'6 II'!D20","v":0},{"$f":"'5 II'!F20+'6 II'!E20","v":0},null,""]
[null,"Наблюдение върху протичането на нормална бременност Z34","08",{"$f":"'5 II'!D21+'6 II'!D21","v":0},{"$f":"'5 II'!F21+'6 II'!E21","v":0},null,""]
[null,"Грижа за изкуствени отвори Z43","09",{"$f":"'5 II'!D22+'6 II'!D22","v":0},{"$f":"'5 II'!F22+'6 II'!E22","v":0},null,""]
[null,"Помощ, включваща използване на рехабилитационни процедури Z50","10",{"$f":"'5 II'!D23+'6 II'!D23","v":0},null,null,""]
[null,"Рехабилитация при болест на сърцето Z50.0","11",{"$f":"'5 II'!D24+'6 II'!D24","v":0},null,null,""]
[null,"Друг вид физиотерапия Z50.1","12",{"$f":"'5 II'!D25+'6 II'!D25","v":0},null,null,""]
[null,"Рехабилитация на лица, страдащи от алкохолизъм Z50.2","13",{"$f":"'5 II'!D26+'6 II'!D26","v":0},null,null,""]
[null,"Рехабилитация на лица, страдащи от наркомания Z50.3","14",{"$f":"'5 II'!D27+'6 II'!D27","v":0},null,null,""]
[null,"Жертва на престъпление и тероризъм Z65.4","15",{"$f":"'5 II'!D28+'6 II'!D28","v":0},{"$f":"'5 II'!F28+'6 II'!E28","v":0},null,""]
[]
["ВЕРТИКАЛЕН КОНТРОЛ:"]
{"$rows_left_out":5}
{"sheet":"Общо ІІІ","index":8,"n_rows":45,"n_cols":7,"rows_kept":45,"cut":false,"hidden":false,"merged":[[42,6,42,8],[43,2,43,4],[43,6,43,8],[44,2,44,4],[44,6,44,8],[5,1,5,3],[10,1,11,1],[10,2,11,2],[10,3,11,3],[42,2,42,4]]}
[{"$f":"'5 I'!A1","v":"05"},"Област:",{"$f":"'5 I'!C1","v":"05 Видин                "}]
[{"$f":"'5 I'!A2","v":""},"Лечебно заведение:",{"$f":"'5 I'!C2","v":0}]
[null,"Година:",{"$f":"'5 I'!C3","v":2023}]
[]
[]
[6,"Външни причини за заболеваемост и смъртност - ОБЩО"]
[]
[null,"Раздел IІІ"]
[]
[]
[null,"НАИМЕНОВАНИЕ  ПО МКБ–10","Ши-фър","Регистрирани случаи"]
[]
[null,"а","б",1]
[null,"ХХ. Външни причини за заболеваемост и смъртност V01–Y98","01",{"$f":"'5 III'!D14+'6 III'!D14","v":0}]
[null,"Злополуки V01–X59","02",{"$f":"'5 III'!D15+'6 III'!D15","v":0}]
[null,"Транспортни злополуки V01–V99","03",{"$f":"'5 III'!D16+'6 III'!D16","v":0}]
[null,"Пешеходец или велосипедист, пострадал при транспортна злополука V01–V19 ","04",{"$f":"'5 III'!D17+'6 III'!D17","v":0}]
[null,"Мотоциклетист; лице, намиращо се в: моторно превозно средство на три колела; лек автомобил; тежкотоварен автомобил; автобус и пострадало при транспортна злополука; злополуки, свързани с други наземни транспортни средства; при воден транспорт; при въздушен транспорт и космически полети, и други V20–V99","05",{"$f":"'5 III'!D18+'6 III'!D18","v":0}]
[null,"Други външни причини за травми при злополуки W00–X59","06",{"$f":"'5 III'!D19+'6 III'!D19","v":0}]
[null,"Падания W00–W19","07",{"$f":"'5 III'!D20+'6 III'!D20","v":0}]
[null,"Въздействие на неживи или живи механични сили W20–W64","08",{"$f":"'5 III'!D21+'6 III'!D21","v":0}]
[null,"Случайно удавяне и потъване във вода и други злополуки със заплаха за дишането W65–W84","09",{"$f":"'5 III'!D22+'6 III'!D22","v":0}]
[null,"Злополуки, предизвикани от въздействие на електрически ток, облъчване и екстремни стойности на температурата на околната среда или атмосферното налягане W85–W99","10",{"$f":"'5 III'!D23+'6 III'!D23","v":0}]
[null,"Въздействие на дим, огън и пламък и съприкосновение с горещи и нажежени вещества (предмети) X00–X19","11",{"$f":"'5 III'!D24+'6 III'!D24","v":0}]
[null,"Контакт с отровни животни и растения X20–X29","12",{"$f":"'5 III'!D25+'6 III'!D25","v":0}]
[null,"Случайно отравяне и въздействие на отровни вещества X40–X49","13",{"$f":"'5 III'!D26+'6 III'!D26","v":0}]
[null,"Умишлено самонараняване X60–X84","14",{"$f":"'5 III'!D27+'6 III'!D27","v":0}]
[null,"Нападение X85–Y09","15",{"$f":"'5 III'!D28+'6 III'!D28","v":0}]
[null,"Законни действия и военни операции Y35–Y36","16",{"$f":"'5 III'!D29+'6 III'!D29","v":0}]
[]
{"$rows_left_out":16}
{"sheet":"obl","index":9,"n_rows":28,"n_cols":2,"rows_kept":28,"cut":false,"hidden":true,"merged":[]}
["01 Благоевград                ","01"]
["02 Бургас       ","02"]
["03 Варна                ","03"]
["04 Велико Търново       ","04"]
["05 Видин                ","05"]
["06 Враца                ","06"]
["07 Габрово              ","07"]
["08 Добрич               ","08"]
["09 Кърджали             ","09"]
["10 Кюстендил            ","10"]
["11 Ловеч                ","11"]
["12 Монтана              ","12"]
["13 Пазарджик            ","13"]
["14 Перник               ","14"]
["15 Плевен               ","15"]
["16 Пловдив              ","16"]
["17 Разград              ","17"]
["18 Русе                 ","18"]
["19 Силистра             ","19"]
["20 Сливен               ","20"]
["21 Смолян               ","21"]
["22 София (столица)      ","22"]
["23 София                ","23"]
["24 Стара Загора         ","24"]
["25 Търговище            ","25"]
["26 Хасково              ","26"]
["27 Шумен                ","27"]
["28 Ямбол                ","28"]

{"sheet":"zav","index":10,"n_rows":196,"n_cols":3,"rows_kept":196,"cut":false,"hidden":true,"merged":[]}
["01","01  Индивидуални практики за ПМП - Благоевград","111"]
["01","01  Групови практики за ПМП - Благоевград","131"]
["01","01  Индивидуални практики за СМП - Благоевград","211"]
["01","01  Групови практики за СМП - Благоевград","231"]
["01","01  Медицински центрове - Благоевград","251"]
["01","01  Медико-дентални центрове - Благоевград","270"]
["01","01  Диагностично-консултативни центрове - Благоевград","281"]
["02","02  Индивидуални практики за ПМП - Бургас","111"]
["02","02  Групови практики за ПМП - Бургас","131"]
["02","02  Индивидуални практики за СМП - Бургас","211"]
["02","02  Групови практики за СМП - Бургас","231"]
["02","02  Медицински центрове - Бургас","251"]
["02","02  Медико-дентални центрове - Бургас","270"]
["02","02  Диагностично-консултативни центрове - Бургас","281"]
["03","03  Индивидуални практики за ПМП - Варна","111"]
["03","03  Групови практики за ПМП - Варна","131"]
["03","03  Индивидуални практики за СМП - Варна","211"]
["03","03  Групови практики за СМП - Варна","231"]
["03","03  Медицински центрове - Варна","251"]
["03","03  Медико-дентални центрове - Варна","270"]
["03","03  Диагностично-консултативни центрове - Варна","281"]
["04","04  Индивидуални практики за ПМП - В. Търново","111"]
["04","04  Групови практики за ПМП - В. Търново","131"]
["04","04  Индивидуални практики за СМП - В. Търново","211"]
["04","04  Групови практики за СМП - В. Търново","231"]
["04","04  Медицински центрове - В. Търново","251"]
["04","04  Медико-дентални центрове - В. Търново","270"]
["04","04  Диагностично-консултативни центрове - В. Търново","281"]
["05","05  Индивидуални практики за ПМП - Видин","111"]
["05","05  Групови практики за ПМП - Видин","131"]
{"$rows_left_out":166}